{"text_format":"3","workbook":"xlsx","n_sheets":2,"sheets":["Sheet1","Sheet2"],"not_rendered":{"defined_names":1},"read":"whole","date_system":"1900"}

{"sheet":"Sheet1","index":0,"n_rows":8,"n_cols":17,"rows_kept":8,"merged":[[0,0,0,14],[1,0,2,0],[1,1,2,1],[1,2,2,2],[1,3,2,3],[1,4,2,4],[1,5,2,5],[1,6,2,6],[1,7,2,7],[1,8,1,11],[1,12,1,13],[1,14,2,14],[1,15,2,15],[1,16,2,16]]}
["附件3：2022-2023学年校长奖学金候选学生推荐汇总表"]
["序号","学院","年级","专业","学号","姓名","是否符合学校奖学金评选条件","体测成绩","2022-2023学年学习成绩和综合测评情况",{"$nulls":3},"在社会实践、创新能力、综合素质等方面的突出表现情况（按时间顺序）",null,"按学院细则测算成果分（满分60分）","是否破格","备注"]
[{"$nulls":8},"必修课加权平均成绩与选修课折合成绩之和在专业内排名（排名/专业总人数）","必修课加权平均成绩与选修课折合成绩之和在专业内排名的范围","综合测评在专业内排名（排名/专业总人数）","综合测评\n在专业内排名的范围","省级及以上表彰或成果（若以2人及以上团队参与的竞赛、发表的论文或专利的，必须注明团队总人数和自己在团队中的排序；发表论文的，需特别注明期刊等级，如SCI_区/EI/中文核心期刊/普刊等）","代表性校级表彰或成果（最多填4项）"]
[1,"计算机学院、网络空间安全学院","2020","计算机科学与技术（腾讯实验班）","202083290338","朱瑞恺","是","78.6","1/29","3.4%","1/29","3.4%","1.2020年12月江苏省第六届大学生艺术展演活动朗诵展演甲组二等奖；(1/6)\n2.2021年5月第十二届蓝桥杯全国软件和信息技术专业人才大赛C/C++程序设计大学B组一等奖；\n3.2021年5月江苏省第十二届大学生知识竞赛（理工科组）优秀奖；\n4.2021年6月第十二届蓝桥杯全国软件和信息技术专业人才大赛全国总决赛C/C++程序设计大学B组二等奖；\n5.2021年12月普通话二级甲等证书；\n6.2022年2月软件著作权《基于差序格局的农民职业社交互动软件》第三著作权人；(3/5)\n7.2022年5月第十三届蓝桥杯全国软件和信息技术专业人才大赛C/C++程序设计大学B组一等奖；\n8.2022年5月美国大学生数学建模竞赛H奖；(3/3)\n9.2022年6月第十三届蓝桥杯全国软件和信息技术专业人才大赛全国总决赛C/C++程序设计大学B组二等奖；\n10.2023年4月软件著作权《OpenBCI信号实时在线多函数拟合仿真平台V1.0》唯一著作权人；\n11.2023年5月美国大学生数学建模竞赛S奖；(3/3)\n12.2023年5月第十四届蓝桥杯全国软件和信息技术专业人才大赛C/C++程序设计大学B组一等奖；\n13.2023年6月第一届“联通软研杯”江苏省高校IT职业能力提升行动暨程序设计大赛三等奖；(2/3)\n14.2023年6月第十四届蓝桥杯全国软件和信息技术专业人才大赛全国总决赛C/C++程序设计大学B组二等奖；\n15.2023年6月主持国家级大学生创新创业训练项目《基于可穿戴式脑机接口的学习专注度监测系统的设计与实现》结项，项目编号：202210300031Z(1/5)","1.2022年5月2021至2022学年优秀共青团员；\n2.2022年12月2021至2022学年三好学生；\n3.2022年12月2021至2022学年优秀学生干部；\n4.2023年5月2022年度南京信息工程大学青年五四标兵。",{"$f":"VLOOKUP(F4,Sheet2!A:B,2,0)","v":68},"否"]
["2","计算机学院、网络空间安全学院",2020,"信息安全","202083290464","张倩月","是",82.8,"2/126","1.6%","1/126","0.8%","1.2023.08 江苏省优秀学生干部；\n2.2023.05 美国大学生数学建模竞赛F奖（1/3）；\n3.2023.04 第十四届蓝桥杯江苏赛区C/C++程序设计大赛B组三等奖；\n4.2023.03 第七届密码技术竞赛国家级三等奖（2/3）；\n5.2022.12 高教社杯全国大学生数学建模竞赛江苏省三等奖（1/3）；\n6.2022.11 第一届仿真创新应用大赛江苏省二等奖（2/2）；\n7.2023.05 SCI四区期刊《Advances in Computers》发表论文，排名2/4；\n8.2023.01 发表软件著作权《基于深度特征线性判别的指纹取证系统》，独立作者；","1.2022.12 校一等奖学金；\n2.2022.12 校三好学生；\n3.2021.12 校一等奖学金；\n4.2021.12 校三好学生标兵；",{"$f":"VLOOKUP(F5,Sheet2!A:B,2,0)","v":61},"否"]
["3","计算机学院、网络空间安全学院","2020","计算机科学与技术（腾讯实验班）","202083290162","李翰文","是","66.8","2/29","6.9%","2/29","6.9%","1.2021.12 第十三届全国大学生数学竞赛（非数学类）一等奖；\n2.2022.05 第十三届蓝桥杯全国软件和信息技术专业人才大赛江苏赛区C/C++程序设计大学B组二等奖；\n3.2022.05 浦芯精英奖学金；\n4.2022.11 全国大学生数学建模竞赛国级一等奖（1/3）；\n5.2022.12 国家奖学金；\n6.2023.06 江苏省省级三好学生；\n7.2022.07 软件著作权：无线网连接跟进接收系统 V1.0（1/1）；\n8.2023.05 SCI一区期刊《Tsinghua Science and Technology》发表论文，排名：1/5；\n9.2023.06 SCI一区期刊《IEEE Internet of Things Journal》发表论文，排名：2/4。","1.2021.12 南京信息工程大学三好学生标兵；\n2.2022.05 南京信息工程大学第十六届数学建模竞赛一等奖（1/3）； \n3.2022.12 南京信息工程大学三好学生标兵；\n4.2022.11 2021年校级大创项目“互联网+”大赛、“挑战杯”系列竞赛专项项目：Wi-Fi雷达-面向人群密集度实时监测的无源感知系统（项目编号：XJDCZX202110300030），主持人。",{"$f":"VLOOKUP(F6,Sheet2!A:B,2,0)","v":59},"否"]
["4","计算机学院、网络空间安全学院","2020","计算机科学与技术","202083290477","于悦","是","79.4","6/223",{"v":0.027,"d":"2.70%"},"2/223",{"v":0.009,"d":"0.9%"},"1.2021年5月全国大学生英语竞赛C类三等奖；\n2.2022年5月全国大学生数学建模大赛省三等奖(1/3)；3.2022年11月全国仿真创新应用大赛本科组省二等奖(1/2)；\n4.2023年5月美国大学生数学建模大赛特等奖提名奖(2/3)；\n5.2023年5月，获得计算机软件著作权《悦住酒店管理系统V1.0》；\n6.2023年8月，以第一作者身份发表sci论文《Face Super-Resolution via Joint Edge Information and Attention Aggregation Network》","1.2021年3月南京信息工程大学第四届高等数学竞赛理工类二等奖；\n2.2022年5月被评为2021年度“优秀共青团干部”；\n3.2022年12月获评为校“三好学生”；\n4.2022年6月南京信息工程大学数学建模大赛二等奖",{"$f":"VLOOKUP(F7,Sheet2!A:B,2,0)","v":58},"否"]
[5,"计算机学院、网络空间安全学院",2020,"计算机科学与技术","202083290503","胡天乐","是","67.4","3/223","1.3%","1/223","0.4%","1.2022.05 第十三届蓝桥杯全国软件和信息技术专业人才大赛江苏赛区C/C++程序设计大学B组一等奖；\n2.2022.06 第十三届蓝桥杯全国软件和信息技术专业人才大赛全国总决赛C/C++程序设计大学B组优秀奖；\n3.2023.01 第十四届全国大学生数学竞赛江苏赛区三等奖；\n4.2023.01 中华人民共和国版权局计算机软件著作权登记：2023SR0046303《灯塔书店：书籍销售管理系统V1.0》\n5.2023.04 第十四届蓝桥杯全国软件和信息技术专业人才大赛江苏赛区C/C++程序设计大学B组一等奖；\n5.2023.05 江苏省三好学生；\n6.2023.05 美国大学生数学建模竞赛荣誉奖","1.2022.11 南京信息工程大学艾瑞励志奖助学金；\n2.2022.12 南京信息工程大学2021-2022学.三好学生标兵；\n3.2022.12 南京信息工程大学2021-2022学.优秀学生干部；\n4.2022.12 南京信息工程大学2021-2022学.学校奖学金一等奖学金",{"$f":"VLOOKUP(F8,Sheet2!A:B,2,0)","v":50},"否"]

{"sheet":"Sheet2","index":1,"n_rows":13,"n_cols":2,"rows_kept":13}
["朱瑞恺",68]
["张倩月",61]
["李翰文",59]
["于悦",58]
["胡天乐",50]
["邹杨和",47]
["韩洋",40]
["管润达",47]
["赵亦璞",38]
["吕正",34]
["郑志勇",31]
["潘禹奇",30]
["梁琬珩",27]